BDBM200228 AB01275474-01::cid_24871309
SMILES CC(C)C[C@@H](NC(=O)[C@H](Cc1ccccc1)NC(=O)c1cnccn1)B(O)O
InChI Key InChIKey=GXJABQQUPOEUTA-DOTOQJQBSA-N
Data  3 IC50  1 EC50
PDB links: 1 PDB ID matches this monomer.
  Tab Delimited (TSV)   2D SDfile   Computed 3D by Vconf -m prep SDfile
Find this compound or compounds like it in BindingDB:
Activity Spreadsheet -- Enzyme Inhibition Constant Data from BindingDB
Found 1 hit for monomerid = 200228
TargetLon protease homolog, mitochondrial(Homo sapiens)
Genomics Institute Of The Novartis Research Foundation
Curated by ChEMBL
LigandPNGBDBM200228(AB01275474-01 | cid_24871309)
Affinity DataIC50:  2.11E+3nM. Assay description: Inhibition of LONP1 (unknown origin) using QXL520-YRGITCSGRQK(5-FAM)-NH2 peptide as substrate incubated for 50 mins in presence of ATP by HTRF assay
In DepthDetails ArticlePubMed